{"text_format":"1","workbook":"xlsx","n_sheets":10,"sheets":["Tracking","TOC","NOTES","Tab 5-7a Soil & Air EPCs","Tab 5-8 PEF Calculation","Tab 5-12C Soil to Air TF","Tab 5-15 Exposure Assumption","Tab 5-16 Tox","Tab Q-1a Indoor Worker Parcel H","Tab Q-2a OutdoorWorker Parcel H"],"not_rendered":{"charts":0,"images":0,"macros":1,"external_links":0,"defined_names":80,"comments":0,"pivot_tables":0},"unopened":[],"bounds":{"document_bytes":16777216,"sheet_cells":100000,"rows_first":2000,"rows_last":500,"rows_between":2000,"halvings":0,"cell_chars":16384,"cell_head_chars":4096},"cells_cut":0,"cells_raw":0,"read":"whole","date_system":"1900"}

{"sheet":"Tracking","index":0,"n_rows":11,"n_cols":5,"rows_kept":11,"cut":false,"hidden":false,"merged":[]}
["Layout Macro Fields","Value",null,"Formatting Codes"]
["Site Name","Nevada Environmental Response Trust Site","Henderson, Nevada"]
["Left Header",null,"Usually blank for publication"]
["Center Header",null,"Usually blank"]
["Right Header",null,"Doc Status: Draft; Interim Final","&b = bold ; &i = italics; &u=underline"]
["Left Footer",null,"Report Date and location","&6 = 6 pt font; &Z=filepath; &F=filename"]
["Center Footer","Page &p of &n","Page Numbering","&p = page number; &n = total number of pages"]
["Right Footer","Ramboll Environ","Ramboll Environ"]
[]
["Creation Date","Database Date","Version","Description","Owner"]
["2011-10-20",null,1,"Preliminary RBTC calculations","KZ"]

{"sheet":"TOC","index":1,"n_rows":4,"n_cols":2,"rows_kept":4,"cut":false,"hidden":false,"merged":[]}
["Table Number","Table Title"]
["TABLE 5-7A","Soil EPCs and EPCs of Airborne Particulates and Vapors for Parcel H_0-2 feet bgs"]
["TABLE Q-1-1A","Estimated Cancer Risks and Non-Cancer Hazard Indices for Indoor Commercial/Industrial Workers Exposed to Soil (0-2 feet bgs) in Parcel H"]
["TABLE Q-1-2A","Estimated Cancer Risks and Non-Cancer Hazard Indices for Outdoor Commercial/Industrial Workers Exposed to Soil (0-2 feet bgs) in Parcel H"]

{"sheet":"NOTES","index":2,"n_rows":8,"n_cols":1,"rows_kept":8,"cut":false,"hidden":false,"merged":[]}
[]
[]
["NOTES:"]
["1.  Before reviewing the risk results for each receptor, first please go to  the [Scen] Tab , and then go to DATA --> What If Analysis --> Scenario Manager to set the exposure scenario you are interested in.  "]
["    Remember to hit CTRL+ALT+F9  to make sure the workbook refreshes the calculations "]
[]
["2.  Always keep the chemical list starting from Row 11"]
["3.  Some formula are set up using array.  After enter the formula, press CTRL+SHIFT+ENTER."]

{"sheet":"Tab 5-7a Soil & Air EPCs","index":3,"n_rows":20,"n_cols":9,"rows_kept":20,"cut":false,"hidden":false,"merged":[[0,0,0,8],[4,7,4,8],[26,0,26,5],[27,0,27,5],[6,0,8,0],[6,1,7,1],[4,5,4,6],[4,0,5,0],[4,2,5,2],[4,4,5,4],[4,3,5,3],[4,1,5,1]]}
[{"$f":"TOC!A2&\". \"&TOC!B2","v":"TABLE 5-7A. Soil EPCs and EPCs of Airborne Particulates and Vapors for Parcel H_0-2 feet bgs"}]
[{"$f":"Tracking!sitename_text","v":"Nevada Environmental Response Trust Site"}]
[{"$f":"Tracking!C2","v":"Henderson, Nevada"}]
[]
["Parcel","Chemical Group","COPC","CAS","Soil EPC [1] \n(mg/kg)","Airborne Particulate EPC [1] (µg/m3)",null,"Vapor EPC [1] (µg/m3)"]
[null,null,null,null,null,"Indoor and Outdoor Commercial/\nIndustrial Worker","Construction Worker","Indoor and Outdoor Commercial/\nIndustrial Worker","Construction Worker"]
["H","Metal","Palladium","7440-05-3",0.47,{"$f":"E7/'Tab 5-8 PEF Calculation'!$C$17*1000","v":4.9225306598131534E-7},{"$f":"E7/'Tab 5-8 PEF Calculation'!$C$51*1000","v":1.1051547174705397E-4},{"$f":"IF('Tab 5-12C Soil to Air TF'!F11=\"--\",\"--\",E7*'Tab 5-12C Soil to Air TF'!F11*1000)","v":"--"},{"$f":"IF('Tab 5-12C Soil to Air TF'!G11=\"--\",\"--\",E7*'Tab 5-12C Soil to Air TF'!G11*1000)","v":"--"}]
[null,null,"Zirconium","7440-67-7",24.9,{"$f":"E8/'Tab 5-8 PEF Calculation'!$C$17*1000","v":2.6078939027520743E-5},{"$f":"E8/'Tab 5-8 PEF Calculation'!$C$51*1000","v":5.8549686095779657E-3},{"$f":"IF('Tab 5-12C Soil to Air TF'!F12=\"--\",\"--\",E8*'Tab 5-12C Soil to Air TF'!F12*1000)","v":"--"},{"$f":"IF('Tab 5-12C Soil to Air TF'!G12=\"--\",\"--\",E8*'Tab 5-12C Soil to Air TF'!G12*1000)","v":"--"}]
[null,"Pesticides - OCP","Hexachlorobenzene","118-74-1",0.21,{"$f":"E9/'Tab 5-8 PEF Calculation'!$C$17*1000","v":2.1994285926824725E-7},{"$f":"E9/'Tab 5-8 PEF Calculation'!$C$51*1000","v":4.9379253333790072E-5},{"$f":"IF('Tab 5-12C Soil to Air TF'!F13=\"--\",\"--\",E9*'Tab 5-12C Soil to Air TF'!F13*1000)","v":9.2393084429118477E-3},{"$f":"IF('Tab 5-12C Soil to Air TF'!G13=\"--\",\"--\",E9*'Tab 5-12C Soil to Air TF'!G13*1000)","v":5.9497718336976986E-2}]
[]
["Notes:"]
["-- = Not applicable"]
["bgs = below ground surface"]
["mg/kg = milligram per kilogram"]
["µg/m3 = microgram per cubic meter"]
{"$rows_left_out":6}
{"sheet":"Tab 5-8 PEF Calculation","index":4,"n_rows":75,"n_cols":5,"rows_kept":75,"cut":false,"hidden":true,"merged":[[4,4,5,4],[6,0,6,4],[17,0,17,4],[64,0,64,4],[71,0,71,4],[4,0,5,0],[4,1,5,1],[4,3,5,3],[67,0,67,4]]}
[{"$f":"TOC!#REF!&\". \"&TOC!#REF!","v":{"$error":"#REF!"}}]
[{"$f":"Tracking!B2","v":"Nevada Environmental Response Trust Site"}]
[{"$f":"Tracking!C2","v":"Henderson, Nevada"}]
[]
["Parameter","Symbol","Value","Unit","Reference"]
[null,null,"Parcel H"]
["Indoor and Outdoor Commercial/Industrial Worker"]
["Fraction of vegetative cover","V",0.5,"unitless","USEPA 2002"]
["Mean annual wind speed","Um",4.0999999999999996,"m/s","[1]"]
["Equivalent threshold value of wind speed","Ut",11.32,"m/s","USEPA 2002"]
["Function dependent on U/Ut","F(x)",0.19400000000000001,"unitless","USEPA 2002"]
["Air dispersion factor for area source (calculated)","Q/Cwind",44.241626722011837,"g/m2-s per kg/m3 ","USEPA 2002"]
["Dispersion factor for area source - Constant A (Las Vegas, NV)","A",13.3093,"unitless","USEPA 2002"]
["Dispersion factor for area source - Constant B (Las Vegas, NV)","B",19.838699999999999,"unitless","USEPA 2002"]
["Dispersion factor for area source - Constant C (Las Vegas, NV)","C",230.1652,"unitless","USEPA 2002"]
{"$rows_left_out":61}
{"sheet":"Tab 5-12C Soil to Air TF","index":5,"n_rows":286,"n_cols":7,"rows_kept":286,"cut":false,"hidden":true,"merged":[[6,0,9,0],[6,1,9,1],[6,3,9,3],[6,4,9,4],[6,5,9,5],[6,6,9,6],[0,1,0,6],[1,1,1,6],[2,1,2,6],[3,1,3,6],[4,3,4,6]]}
[null,{"$f":"TOC!#REF!&\". \"&TOC!#REF!","v":{"$error":"#REF!"}}]
[null,{"$f":"Tracking!B2","v":"Nevada Environmental Response Trust Site"}]
[null,{"$f":"Tracking!C2","v":"Henderson, Nevada"}]
[]
[]
[]
["Volatile COPC","Chemical\nGroup",null,"Chemical","CASRN","TF for Soil Migrating to Outdoor Air (µg/m3 per µg/kg)","TF for Soil Migrating to Trench Air \n(µg/m3 per µg/kg)"]
[]
[]
[null,null,"Sort Name"]
[{"$f":"'Tab 5-16 Tox'!Y11:Y280","v":0},{"$f":"'Tab 5-16 Tox'!B11:E280","v":"Metal"},0,"Palladium","7440-05-3","--","--"]
[0,"Metal",0,"Zirconium","7440-67-7","--","--"]
["X","Pesticide - OCP",0,"Hexachlorobenzene","118-74-1",4.3996706871008799E-5,2.8332246827131899E-4]
[0,0,0,0,0]
[0,0,0,0,0]
{"$rows_left_out":272}
{"sheet":"Tab 5-15 Exposure Assumption","index":6,"n_rows":59,"n_cols":9,"rows_kept":59,"cut":false,"hidden":true,"merged":[[7,0,7,8],[16,0,16,8],[21,0,21,8],[27,0,27,8],[51,0,51,12],[45,0,45,8],[48,0,48,8],[49,0,49,8],[50,0,50,8],[31,0,31,8],[47,0,47,22],[46,0,46,8],[0,0,0,8],[1,0,1,8],[4,0,6,0],[4,1,6,1],[4,2,6,2],[2,0,2,8],[4,7,5,8],[4,3,5,4],[4,5,5,6]]}
[{"$f":"TOC!#REF!&\". \"&TOC!#REF!","v":{"$error":"#REF!"}}]
[{"$f":"Tracking!B2","v":"Nevada Environmental Response Trust Site"}]
[{"$f":"Tracking!C2","v":"Henderson, Nevada"}]
[]
["Exposure Factors","Units","Symbol","Indoor Commercial/\nIndustrial Worker",null,"Outdoor Commercial/\nIndustrial Worker",null,"Construction Worker"]
[]
[null,null,null,"Value","Source","Value","Source","Value","Source"]
["Population-Specific Exposure Assumptions"]
["Exposure Time","hours/day","ET",8,"NDEP 2017a",8,"NDEP 2017a",8,"USEPA 2017"]
["Exposure Time_Trench","hours/day","ET","--","--","--","--",4,"VDEQ 2016"]
["Exposure Frequency","days/year","EF",250,"NDEP 2017a",225,"NDEP 2017a",250,"USEPA 2017"]
["Exposure Frequency_Trench","days/year","EF","--","--","--","--",30,"[1]"]
["Exposure Duration","years","ED",25,"NDEP 2017a",25,"NDEP 2017a",1,"USEPA 2017"]
["Body Weight","kgBW","BW",80,"NDEP 2017a",80,"NDEP 2017a",80,"USEPA 2017"]
["Averaging Time for Cancinogens","days","ATc",25550,"NDEP 2017a",25550,"NDEP 2017a",25550,"USEPA 2017"]
{"$rows_left_out":45}
{"sheet":"Tab 5-16 Tox","index":7,"n_rows":301,"n_cols":25,"rows_kept":301,"cut":false,"hidden":true,"merged":[[8,3,9,3],[8,1,9,1],[8,9,9,9],[8,22,9,22],[8,4,9,4],[8,20,8,21],[8,18,9,19],[8,12,9,13],[8,10,9,11],[8,7,9,8],[8,5,9,6],[8,14,9,15],[8,16,9,17],[0,1,0,22],[1,1,1,22],[2,1,2,22],[3,1,3,22],[4,1,4,22]]}
[null,{"$f":"TOC!#REF!&\". \"&TOC!#REF!","v":{"$error":"#REF!"}}]
[null,{"$f":"Tracking!B2","v":"Nevada Environmental Response Trust Site"}]
[null,{"$f":"Tracking!C2","v":"Henderson, Nevada"}]
[]
[]
[]
[]
[]
[null,"Chemical\nGroup",null,"Chemical","CASRN","Oral Cancer Slope Factor  \n(mg/kg-day)-1",null,"Inhalation Unit Risk\n(µg/m3)-1",null,"USEPA Weight-of-Evidence Carcinogen Classification","Oral Chronic RfD\n(mg/kg-day)",null,"Inhalation Chronic RfC\n(µg/m3)",null,"Oral Subchronic RfD\n(mg/kg-day)",null,"Inhalation Subchronic RfC\n(µg/m3)",null,"Soil Dermal Absorption Factor\nABSsoil ",null,"ADAF",null,"Inhalation Relative Absorption Factor"]
["COPC at Site",null,"Sort Name",null,null,null,null,null,null,null,null,null,null,null,null,null,null,null,null,null,"Child \nResident","Adult \nResident",null,"Parcel H\nCOPC","VOC"]
["X","Metal",null,"Palladium","7440-05-3","--","--","--","--","--","--","--","--","--","--","--","--","--","--","--",null,null,1,"X"]
["X","Metal",null,"Zirconium","7440-67-7","--","--","--","--","--",8.0000000000000007E-5,"PPRTV Appendix","--","--",8.0000000000000007E-5,"PPRTV Appendix  [1]","--","--","--","--",null,null,1,"X"]
["X","Pesticide - OCP",null,"Hexachlorobenzene","118-74-1",1.6,"IRIS",4.6000000000000001E-4,"IRIS","B2",8.0000000000000004E-4,"IRIS","--","--",1.0000000000000001E-5,"PPRTV","--","--","--","--",null,null,1,"X","X"]
[]
[]
{"$rows_left_out":287}
{"sheet":"Tab Q-1a Indoor Worker Parcel H","index":8,"n_rows":288,"n_cols":20,"rows_kept":288,"cut":false,"hidden":false,"merged":[[6,8,6,9],[6,16,6,17],[6,18,9,18],[6,19,9,19],[280,1,280,3],[6,13,6,14],[0,1,0,19],[1,1,1,19],[2,1,2,19],[3,1,3,19],[4,3,4,19],[6,0,9,0],[6,1,9,1],[6,3,9,3],[6,4,9,4],[6,5,6,6]]}
[null,{"$f":"TOC!A3&\". \"&TOC!B3","v":"TABLE Q-1-1A. Estimated Cancer Risks and Non-Cancer Hazard Indices for Indoor Commercial/Industrial Workers Exposed to Soil (0-2 feet bgs) in Parcel H"}]
[null,{"$f":"Tracking!B2","v":"Nevada Environmental Response Trust Site"}]
[null,{"$f":"Tracking!C2","v":"Henderson, Nevada"}]
[]
[]
[]
["Parcel C COPC","Chemical\nGroup",null,"Chemical","CASRN",null,null,null,"Soil Ingestion",null,null,null,null,"Vapor Inhalation",null,null,"Airborne Particulate Inhalation",null,"Cancer Risk_All Pathways","Non-Cancer HQ_All Pathways"]
[null,null,null,null,null,null,null,null,"Cancer IF","Noncancer IF",null,null,null,"Cancer IF","Noncancer IF",null,"Cancer IF","Noncancer IF"]
[null,null,null,null,null,null,null,null,{"$f":"'Tab 5-15 Exposure Assumption'!D20","v":1.5288649706457926E-7},{"$f":"'Tab 5-15 Exposure Assumption'!D21","v":4.2808219178082193E-7},null,null,null,{"$f":"'Tab 5-15 Exposure Assumption'!D34","v":8.1539465101108904E-2},{"$f":"'Tab 5-15 Exposure Assumption'!D35","v":0.22831050228310501},null,{"$f":"'Tab 5-15 Exposure Assumption'!D30","v":8.1539465101108932E-2},{"$f":"'Tab 5-15 Exposure Assumption'!D31","v":0.22831050228310501}]
[null,null,"Sort Name",null,null,"SForal\n(mg/kg/d)-1","RfDoral\n(mg/kg/d)","Soil EPC (mg/kg)","Cancer Risk","Non-Cancer HQ","IUR\n(ug/m3)-1","RfC\n(ug/m3)","Vapor EPC (ug/m3)","Cancer \nRisk","Non-Cancer \nHQ","Airborne Particulate EPC (ug/m3)","Cancer \nRisk","Non-Cancer \nHQ"]
[{"$f":"'Tab 5-16 Tox'!X11:X280","v":"X"},{"$f":"'Tab 5-16 Tox'!B11:E280","v":"Metal"},0,"Palladium","7440-05-3",{"$f":"IF(ISNUMBER('Tab 5-16 Tox'!$F11:$F280),'Tab 5-16 Tox'!$F11:$F280,\"--\")","v":"--"},{"$f":"IF(ISNUMBER('Tab 5-16 Tox'!$K11:$K280),'Tab 5-16 Tox'!$K11:$K280,\"--\")","v":"--"},{"$f":"IF(ISNUMBER(VLOOKUP(E11,'Tab 5-7a Soil & Air EPCs'!$D$7:$E$9,2,FALSE)),VLOOKUP(E11,'Tab 5-7a Soil & Air EPCs'!$D$7:$E$9,2,FALSE),\"--\")","v":0.47},{"$f":"IF(F11:F280<>\"--\",IF(H11:H280<>\"--\",H11:H280*I9*F11:F280,\"--\"),\"--\")","v":"--"},{"$f":"IF(G11:G280<>\"--\",IF(H11:H280<>\"--\",H11:H280*J9/G11:G280,\"--\"),\"--\")","v":"--"},{"$f":"IF(ISNUMBER('Tab 5-16 Tox'!$H11:$H280),'Tab 5-16 Tox'!$H11:$H280,\"--\")","v":"--"},{"$f":"IF(ISNUMBER('Tab 5-16 Tox'!$M11:$M280),'Tab 5-16 Tox'!$M11:$M280,\"--\")","v":"--"},{"$f":"IF(ISNUMBER(VLOOKUP(E11,'Tab 5-7a Soil & Air EPCs'!$D$7:$H$9,5,FALSE)),VLOOKUP(E11,'Tab 5-7a Soil & Air EPCs'!$D$7:$H$9,5,FALSE),\"--\")","v":"--"},{"$f":"IF(K11:K280<>\"--\",IF(M11:M280<>\"--\",M11:M280*N9*K11:K280,\"--\"),\"--\")","v":"--"},{"$f":"IF(L11:L280<>\"--\",IF(M11:M280<>\"--\",M11:M280*O9/L11:L280,\"--\"),\"--\")","v":"--"},{"$f":"IF(ISNUMBER(VLOOKUP(E11,'Tab 5-7a Soil & Air EPCs'!$D$7:$F$9,3,FALSE)),VLOOKUP(E11,'Tab 5-7a Soil & Air EPCs'!$D$7:$F$9,3,FALSE),\"--\")","v":4.9225306598131534E-7},{"$f":"IF(K11:K280<>\"--\",IF(P11:P280<>\"--\",P11:P280*Q9*K11:K280,\"--\"),\"--\")","v":"--"},{"$f":"IF(L11:L280<>\"--\",IF(P11:P280<>\"--\",P11:P280*R9/L11:L280,\"--\"),\"--\")","v":"--"},{"$f":"IF(SUM(I11,N11,Q11)>0,SUM(I11,N11,Q11),\"--\")","v":"--"},{"$f":"IF(SUM(J11,O11,R11)>0,SUM(J11,O11,R11),\"--\")","v":"--"}]
["X","Metal",0,"Zirconium","7440-67-7","--",8.0000000000000007E-5,{"$f":"IF(ISNUMBER(VLOOKUP(E12,'Tab 5-7a Soil & Air EPCs'!$D$7:$E$9,2,FALSE)),VLOOKUP(E12,'Tab 5-7a Soil & Air EPCs'!$D$7:$E$9,2,FALSE),\"--\")","v":24.9},"--",0.13324058219178081,"--","--",{"$f":"IF(ISNUMBER(VLOOKUP(E12,'Tab 5-7a Soil & Air EPCs'!$D$7:$H$9,5,FALSE)),VLOOKUP(E12,'Tab 5-7a Soil & Air EPCs'!$D$7:$H$9,5,FALSE),\"--\")","v":"--"},"--","--",{"$f":"IF(ISNUMBER(VLOOKUP(E12,'Tab 5-7a Soil & Air EPCs'!$D$7:$F$9,3,FALSE)),VLOOKUP(E12,'Tab 5-7a Soil & Air EPCs'!$D$7:$F$9,3,FALSE),\"--\")","v":2.6078939027520743E-5},"--","--",{"$f":"IF(SUM(I12,N12,Q12)>0,SUM(I12,N12,Q12),\"--\")","v":"--"},{"$f":"IF(SUM(J12,O12,R12)>0,SUM(J12,O12,R12),\"--\")","v":0.13324058219178081}]
["X","Pesticide - OCP",0,"Hexachlorobenzene","118-74-1",1.6,8.0000000000000004E-4,{"$f":"IF(ISNUMBER(VLOOKUP(E13,'Tab 5-7a Soil & Air EPCs'!$D$7:$E$9,2,FALSE)),VLOOKUP(E13,'Tab 5-7a Soil & Air EPCs'!$D$7:$E$9,2,FALSE),\"--\")","v":0.21},5.1369863013698629E-8,1.1237157534246574E-4,4.6000000000000001E-4,"--",{"$f":"IF(ISNUMBER(VLOOKUP(E13,'Tab 5-7a Soil & Air EPCs'!$D$7:$H$9,5,FALSE)),VLOOKUP(E13,'Tab 5-7a Soil & Air EPCs'!$D$7:$H$9,5,FALSE),\"--\")","v":9.2393084429118477E-3},3.465494034360281E-7,"--",{"$f":"IF(ISNUMBER(VLOOKUP(E13,'Tab 5-7a Soil & Air EPCs'!$D$7:$F$9,3,FALSE)),VLOOKUP(E13,'Tab 5-7a Soil & Air EPCs'!$D$7:$F$9,3,FALSE),\"--\")","v":2.1994285926824725E-7},8.249650624869026E-12,"--",3.979275161003516E-7,1.1237157534246574E-4]
[0,0,0,0,0,"--","--",{"$f":"IF(ISNUMBER(VLOOKUP(E14,'Tab 5-7a Soil & Air EPCs'!$D$7:$E$9,2,FALSE)),VLOOKUP(E14,'Tab 5-7a Soil & Air EPCs'!$D$7:$E$9,2,FALSE),\"--\")","v":"--"},"--","--","--","--",{"$f":"IF(ISNUMBER(VLOOKUP(E14,'Tab 5-7a Soil & Air EPCs'!$D$7:$H$9,5,FALSE)),VLOOKUP(E14,'Tab 5-7a Soil & Air EPCs'!$D$7:$H$9,5,FALSE),\"--\")","v":"--"},"--","--",{"$f":"IF(ISNUMBER(VLOOKUP(E14,'Tab 5-7a Soil & Air EPCs'!$D$7:$F$9,3,FALSE)),VLOOKUP(E14,'Tab 5-7a Soil & Air EPCs'!$D$7:$F$9,3,FALSE),\"--\")","v":"--"},"--","--","--","--"]
[0,0,0,0,0,"--","--",{"$f":"IF(ISNUMBER(VLOOKUP(E15,'Tab 5-7a Soil & Air EPCs'!$D$7:$E$9,2,FALSE)),VLOOKUP(E15,'Tab 5-7a Soil & Air EPCs'!$D$7:$E$9,2,FALSE),\"--\")","v":"--"},"--","--","--","--",{"$f":"IF(ISNUMBER(VLOOKUP(E15,'Tab 5-7a Soil & Air EPCs'!$D$7:$H$9,5,FALSE)),VLOOKUP(E15,'Tab 5-7a Soil & Air EPCs'!$D$7:$H$9,5,FALSE),\"--\")","v":"--"},"--","--",{"$f":"IF(ISNUMBER(VLOOKUP(E15,'Tab 5-7a Soil & Air EPCs'!$D$7:$F$9,3,FALSE)),VLOOKUP(E15,'Tab 5-7a Soil & Air EPCs'!$D$7:$F$9,3,FALSE),\"--\")","v":"--"},"--","--","--","--"]
{"$rows_left_out":274}
{"sheet":"Tab Q-2a OutdoorWorker Parcel H","index":9,"n_rows":288,"n_cols":23,"rows_kept":288,"cut":false,"hidden":false,"merged":[[280,1,280,3],[4,3,4,22],[0,1,0,22],[1,1,1,22],[2,1,2,22],[3,1,3,22],[6,22,9,22],[6,19,6,20],[6,5,6,6],[6,8,6,9],[6,11,6,12],[6,16,6,17],[6,0,9,0],[6,1,9,1],[6,3,9,3],[6,4,9,4],[6,21,9,21]]}
[null,{"$f":"TOC!A4&\". \"&TOC!B4","v":"TABLE Q-1-2A. Estimated Cancer Risks and Non-Cancer Hazard Indices for Outdoor Commercial/Industrial Workers Exposed to Soil (0-2 feet bgs) in Parcel H"}]
[null,{"$f":"Tracking!B2","v":"Nevada Environmental Response Trust Site"}]
[null,{"$f":"Tracking!C2","v":"Henderson, Nevada"}]
[]
[]
[]
["Parcel C COPC","Chemical\nGroup",null,"Chemical","CASRN",null,null,null,"Soil Ingestion",null,null,"Dermal Contact",null,null,null,null,"Vapor Inhalation",null,null,"Airborne Particulate Inhalation",null,"Cancer Risk_All Pathways","Non-Cancer HQ_All Pathways"]
[null,null,null,null,null,null,null,null,"Cancer IF","Noncancer IF",null,"Cancer IF","Noncancer IF",null,null,null,"Cancer IF","Noncancer IF",null,"Cancer IF","Noncancer IF"]
[null,null,null,null,null,null,null,null,{"$f":"'Tab 5-15 Exposure Assumption'!F20","v":2.7519569471624267E-7},{"$f":"'Tab 5-15 Exposure Assumption'!F21","v":7.7054794520547943E-7},null,{"$f":"'Tab 5-15 Exposure Assumption'!F26","v":1.1647382583170255E-6},{"$f":"'Tab 5-15 Exposure Assumption'!F27","v":3.2612671232876713E-6},null,null,null,{"$f":"'Tab 5-15 Exposure Assumption'!F34","v":7.3385518590998039E-2},{"$f":"'Tab 5-15 Exposure Assumption'!F35","v":0.20547945205479454},null,{"$f":"'Tab 5-15 Exposure Assumption'!F30","v":7.3385518590998039E-2},{"$f":"'Tab 5-15 Exposure Assumption'!F31","v":0.20547945205479454}]
[null,null,"Sort Name",null,null,"SForal\n(mg/kg/d)-1","RfDoral\n(mg/kg/d)","Soil EPC (mg/kg)","Cancer Risk","Non-Cancer HQ","ABSderm\n(unitless)","Cancer Risk","Non-Cancer HQ","IUR\n(ug/m3)-1","RfC\n(ug/m3)","Vapor EPC (ug/m3)","Cancer \nRisk","Non-Cancer \nHQ","Airborne Particulate EPC (ug/m3)","Cancer \nRisk","Non-Cancer \nHQ"]
[{"$f":"'Tab 5-16 Tox'!X11:X280","v":"X"},{"$f":"'Tab 5-16 Tox'!B11:E280","v":"Metal"},0,"Palladium","7440-05-3",{"$f":"IF(ISNUMBER('Tab 5-16 Tox'!$F11:$F280),'Tab 5-16 Tox'!$F11:$F280,\"--\")","v":"--"},{"$f":"IF(ISNUMBER('Tab 5-16 Tox'!$K11:$K280),'Tab 5-16 Tox'!$K11:$K280,\"--\")","v":"--"},{"$f":"IF(ISNUMBER(VLOOKUP(E11,'Tab 5-7a Soil & Air EPCs'!$D$7:$E$9,2,FALSE)),VLOOKUP(E11,'Tab 5-7a Soil & Air EPCs'!$D$7:$E$9,2,FALSE),\"--\")","v":0.47},{"$f":"IF(F11:F280<>\"--\",IF(H11:H280<>\"--\",H11:H280*I9*F11:F280,\"--\"),\"--\")","v":"--"},{"$f":"IF(G11:G280<>\"--\",IF(H11:H280<>\"--\",H11:H280*J9/G11:G280,\"--\"),\"--\")","v":"--"},{"$f":"'Tab 5-16 Tox'!S11:S280","v":"--"},{"$f":"IF(F11:F280<>\"--\",IF(H11:H280<>\"--\",IF(K11:K280<>\"--\",H11:H280*L9*F11:F280*K11:K280,\"--\"),\"--\"),\"--\")","v":"--"},{"$f":"IF(G11:G280<>\"--\",IF(H11:H280<>\"--\",IF(K11:K280<>\"--\",H11:H280*M9*K11:K280/G11:G280,\"--\"),\"--\"),\"--\")","v":"--"},{"$f":"IF(ISNUMBER('Tab 5-16 Tox'!$H11:$H280),'Tab 5-16 Tox'!$H11:$H280,\"--\")","v":"--"},{"$f":"IF(ISNUMBER('Tab 5-16 Tox'!$M11:$M280),'Tab 5-16 Tox'!$M11:$M280,\"--\")","v":"--"},{"$f":"IF(ISNUMBER(VLOOKUP(E11,'Tab 5-7a Soil & Air EPCs'!$D$7:$H$9,5,FALSE)),VLOOKUP(E11,'Tab 5-7a Soil & Air EPCs'!$D$7:$H$9,5,FALSE),\"--\")","v":"--"},{"$f":"IF(N11:N280<>\"--\",IF(P11:P280<>\"--\",P11:P280*Q9*N11:N280,\"--\"),\"--\")","v":"--"},{"$f":"IF(O11:O280<>\"--\",IF(P11:P280<>\"--\",P11:P280*R9/O11:O280,\"--\"),\"--\")","v":"--"},{"$f":"IF(ISNUMBER(VLOOKUP(E11,'Tab 5-7a Soil & Air EPCs'!$D$7:$F$9,3,FALSE)),VLOOKUP(E11,'Tab 5-7a Soil & Air EPCs'!$D$7:$F$9,3,FALSE),\"--\")","v":4.9225306598131534E-7},{"$f":"IF(N11:N280<>\"--\",IF(S11:S280<>\"--\",S11:S280*T9*N11:N280,\"--\"),\"--\")","v":"--"},{"$f":"IF(O11:O280<>\"--\",IF(S11:S280<>\"--\",S11:S280*U9/O11:O280,\"--\"),\"--\")","v":"--"},{"$f":"IF(SUM(I11,L11,Q11,T11)>0,SUM(I11,L11,Q11,T11),\"--\")","v":"--"},{"$f":"IF(SUM(J11,M11,R11,U11)>0,SUM(J11,M11,R11,U11),\"--\")","v":"--"}]
["X","Metal",0,"Zirconium","7440-67-7","--",8.0000000000000007E-5,{"$f":"IF(ISNUMBER(VLOOKUP(E12,'Tab 5-7a Soil & Air EPCs'!$D$7:$E$9,2,FALSE)),VLOOKUP(E12,'Tab 5-7a Soil & Air EPCs'!$D$7:$E$9,2,FALSE),\"--\")","v":24.9},"--",0.23983304794520541,"--","--","--","--","--",{"$f":"IF(ISNUMBER(VLOOKUP(E12,'Tab 5-7a Soil & Air EPCs'!$D$7:$H$9,5,FALSE)),VLOOKUP(E12,'Tab 5-7a Soil & Air EPCs'!$D$7:$H$9,5,FALSE),\"--\")","v":"--"},"--","--",{"$f":"IF(ISNUMBER(VLOOKUP(E12,'Tab 5-7a Soil & Air EPCs'!$D$7:$F$9,3,FALSE)),VLOOKUP(E12,'Tab 5-7a Soil & Air EPCs'!$D$7:$F$9,3,FALSE),\"--\")","v":2.6078939027520743E-5},"--","--",{"$f":"IF(SUM(I12,L12,Q12,T12)>0,SUM(I12,L12,Q12,T12),\"--\")","v":"--"},{"$f":"IF(SUM(J12,M12,R12,U12)>0,SUM(J12,M12,R12,U12),\"--\")","v":0.23983304794520541}]
["X","Pesticide - OCP",0,"Hexachlorobenzene","118-74-1",1.6,8.0000000000000004E-4,{"$f":"IF(ISNUMBER(VLOOKUP(E13,'Tab 5-7a Soil & Air EPCs'!$D$7:$E$9,2,FALSE)),VLOOKUP(E13,'Tab 5-7a Soil & Air EPCs'!$D$7:$E$9,2,FALSE),\"--\")","v":0.21},9.2465753424657539E-8,2.0226883561643834E-4,"--","--","--",4.6000000000000001E-4,"--",{"$f":"IF(ISNUMBER(VLOOKUP(E13,'Tab 5-7a Soil & Air EPCs'!$D$7:$H$9,5,FALSE)),VLOOKUP(E13,'Tab 5-7a Soil & Air EPCs'!$D$7:$H$9,5,FALSE),\"--\")","v":9.2393084429118477E-3},3.1189446309242534E-7,"--",{"$f":"IF(ISNUMBER(VLOOKUP(E13,'Tab 5-7a Soil & Air EPCs'!$D$7:$F$9,3,FALSE)),VLOOKUP(E13,'Tab 5-7a Soil & Air EPCs'!$D$7:$F$9,3,FALSE),\"--\")","v":2.1994285926824725E-7},7.4246855623821237E-12,"--",4.0436764120264531E-7,2.0226883561643834E-4]
[0,0,0,0,0,"--","--",{"$f":"IF(ISNUMBER(VLOOKUP(E14,'Tab 5-7a Soil & Air EPCs'!$D$7:$E$9,2,FALSE)),VLOOKUP(E14,'Tab 5-7a Soil & Air EPCs'!$D$7:$E$9,2,FALSE),\"--\")","v":"--"},"--","--",0,"--","--","--","--",{"$f":"IF(ISNUMBER(VLOOKUP(E14,'Tab 5-7a Soil & Air EPCs'!$D$7:$H$9,5,FALSE)),VLOOKUP(E14,'Tab 5-7a Soil & Air EPCs'!$D$7:$H$9,5,FALSE),\"--\")","v":"--"},"--","--",{"$f":"IF(ISNUMBER(VLOOKUP(E14,'Tab 5-7a Soil & Air EPCs'!$D$7:$F$9,3,FALSE)),VLOOKUP(E14,'Tab 5-7a Soil & Air EPCs'!$D$7:$F$9,3,FALSE),\"--\")","v":"--"},"--","--","--","--"]
[0,0,0,0,0,"--","--",{"$f":"IF(ISNUMBER(VLOOKUP(E15,'Tab 5-7a Soil & Air EPCs'!$D$7:$E$9,2,FALSE)),VLOOKUP(E15,'Tab 5-7a Soil & Air EPCs'!$D$7:$E$9,2,FALSE),\"--\")","v":"--"},"--","--",0,"--","--","--","--",{"$f":"IF(ISNUMBER(VLOOKUP(E15,'Tab 5-7a Soil & Air EPCs'!$D$7:$H$9,5,FALSE)),VLOOKUP(E15,'Tab 5-7a Soil & Air EPCs'!$D$7:$H$9,5,FALSE),\"--\")","v":"--"},"--","--",{"$f":"IF(ISNUMBER(VLOOKUP(E15,'Tab 5-7a Soil & Air EPCs'!$D$7:$F$9,3,FALSE)),VLOOKUP(E15,'Tab 5-7a Soil & Air EPCs'!$D$7:$F$9,3,FALSE),\"--\")","v":"--"},"--","--","--","--"]
{"$rows_left_out":273}